{"text_format":"1","workbook":"xlsx","n_sheets":14,"sheets":["Menu","About the Toolkit","Using the Toolkit","Conducting Assessments","Glossary","Contractor Contact Details","Transferred Materials","Assessment Questions","Summary of Findings","Additional Findings","Calculation","Applicability Reference","Reference","Revision Status"],"not_rendered":{"charts":1,"images":5,"macros":1,"external_links":1,"defined_names":19,"comments":0,"pivot_tables":0},"unopened":[],"bounds":{"document_bytes":16777216,"sheet_cells":100000,"rows_first":2000,"rows_last":500,"rows_between":2000,"halvings":0,"cell_chars":16384,"cell_head_chars":4096},"cells_cut":0,"cells_raw":0,"read":"whole","date_system":"1900"}

{"sheet":"Menu","index":0,"n_rows":24,"n_cols":9,"rows_kept":24,"cut":false,"hidden":false,"merged":[[2,1,2,8],[3,1,3,8],[12,2,12,4],[7,2,7,4],[8,2,8,4],[9,2,9,4],[10,2,10,4],[11,2,11,4],[13,2,13,4],[14,2,14,4],[15,2,15,4],[17,2,17,4],[25,2,25,4],[16,2,16,4],[18,2,18,8],[19,2,19,8],[20,2,20,8],[21,2,21,8],[22,2,22,8],[23,2,23,8],[29,2,29,4],[27,2,27,4],[26,2,26,4]]}
[null,null,null,null,null,null,null,null,"Chain Of Custody Outsource Contractor Assessment Form (T008_2012) Revision 0"]
[]
[null,"RJC Chain of Custody Outsource Contractor Assessment Form"]
[null,"Chain Of Custody Outsource Contractor Assessment Form (T008_2012) Revision 0"]
[]
[null,"MENU"]
[]
[null,"Useful Information","About the Toolkit"]
{"$rows_left_out":17}
{"sheet":"About the Toolkit","index":1,"n_rows":29,"n_cols":2,"rows_kept":29,"cut":false,"hidden":false,"merged":[[10,1,12,1],[13,1,14,1],[25,1,26,1]]}
[null,"About the Toolkit"]
[null,"RJC Chain-of-Custody (CoC) Certification "]
[null,"RJC CoC Outsource Contractor Assessment Form [Document reference - T008_2012]"]
[]
[null,"A. Background"]
[null,"The Responsible Jewellery Council (RJC) is a not-for-profit membership organisation with the following Mission:"]
[null,"To advance responsible ethical, social and environmental practices, which respect human rights, throughout the Jewellery supply chain, from mine to retail.  "]
[]
{"$rows_left_out":22}
{"sheet":"Using the Toolkit","index":2,"n_rows":33,"n_cols":2,"rows_kept":33,"cut":false,"hidden":false,"merged":[[6,1,6,2],[7,1,7,2],[8,1,8,2],[11,1,11,2],[12,1,12,2],[13,1,13,2],[5,1,5,2],[1,1,1,2],[2,1,2,2],[3,1,3,2],[4,1,4,2],[9,1,9,2],[21,1,21,2],[22,1,23,2],[27,1,27,2],[14,1,14,2],[15,1,15,2],[17,1,17,2],[18,1,18,2],[10,1,10,2],[26,1,26,2],[31,1,31,2],[32,1,32,2],[33,1,33,2],[34,1,34,2],[35,1,35,2],[36,1,36,2],[30,1,30,2],[28,1,29,2],[24,1,25,2],[43,1,43,2],[44,1,44,2],[45,1,45,2],[46,1,46,2],[47,1,47,2],[48,1,48,2],[37,1,37,2],[38,1,38,2],[39,1,39,2],[40,1,40,2],[41,1,41,2],[42,1,42,2],[55,1,55,2],[56,1,56,2],[57,1,57,2],[58,1,58,2],[59,1,59,2],[60,1,60,2],[49,1,49,2],[50,1,50,2],[51,1,51,2],[52,1,52,2],[53,1,53,2],[54,1,54,2],[67,1,67,2],[68,1,68,2],[69,1,69,2],[70,1,70,2],[71,1,71,2],[72,1,72,2],[61,1,61,2],[62,1,62,2],[63,1,63,2],[64,1,64,2],[65,1,65,2],[66,1,66,2],[79,1,79,2],[80,1,80,2],[81,1,81,2],[82,1,82,2],[83,1,83,2],[84,1,84,2],[73,1,73,2],[74,1,74,2],[75,1,75,2],[76,1,76,2],[77,1,77,2],[78,1,78,2],[91,1,91,2],[92,1,92,2],[93,1,93,2],[94,1,94,2],[95,1,95,2],[96,1,96,2],[85,1,85,2],[86,1,86,2],[87,1,87,2],[88,1,88,2],[89,1,89,2],[90,1,90,2],[109,1,109,2],[110,1,110,2],[103,1,103,2],[104,1,104,2],[105,1,105,2],[106,1,106,2],[107,1,107,2],[108,1,108,2],[97,1,97,2],[98,1,98,2],[99,1,99,2],[100,1,100,2],[101,1,101,2],[102,1,102,2]]}
[null,"Guidance for Using the Toolkit"]
[null,"This worksheet contains information about the toolkit and its features  The following topics are covered (navigate by clicking the topic headings):"]
[null,"Features"]
[null,"Enabling Macros"]
[]
[]
[null,"Features"]
[]
{"$rows_left_out":26}
{"sheet":"Conducting Assessments","index":3,"n_rows":50,"n_cols":2,"rows_kept":50,"cut":false,"hidden":false,"merged":[[1,1,1,2],[2,1,2,2],[3,1,3,2],[4,1,4,2],[5,1,5,2],[19,1,19,2],[20,1,22,2],[32,1,32,2],[26,1,26,2],[27,1,27,2],[28,1,28,2],[29,1,29,2],[23,1,23,2],[24,1,24,2],[31,1,31,2],[25,1,25,2],[6,1,6,2],[7,1,7,2],[15,1,15,2],[16,1,16,2],[17,1,18,2],[8,1,8,2],[9,1,9,2],[10,1,10,2],[33,1,33,2],[35,1,35,2],[30,1,30,2],[43,1,43,2],[36,1,36,2],[37,1,37,2],[38,1,38,2],[39,1,39,2],[40,1,40,2],[41,1,41,2],[42,1,42,2],[51,1,51,2],[49,1,50,2],[48,1,48,2],[47,1,47,2],[34,1,34,2],[46,1,46,2],[44,1,45,2]]}
[null,"Guidance for Using the Toolkit"]
[null,"This worksheet contains guidance on conducting CoC Assessments and Audits.  The following topics are covered (navigate by clicking the topic headings):"]
[null,"Guidance about the sections in this Form:"]
[null,"Part 1:  Outsourcing Contractor Contact Details"]
[null,"Part 2:  Transferred Materials"]
[null,"Part 3a: Assessment Questions"]
[null,"Part 3b: Summary of Findings"]
[null,"Part 3c: Additional Findings"]
{"$rows_left_out":43}
{"sheet":"Glossary","index":4,"n_rows":140,"n_cols":2,"rows_kept":140,"cut":false,"hidden":false,"merged":[]}
[]
[null,"GLOSSARY"]
[null,"Accredited Auditor:  An independent, third party person or organisation meeting the RJC’s objective selection criteria and accredited to carry out RJC-related audits."]
[]
[null,"Adjoining Country: Defined with reference to Section 1502 of the United States’ Dodd-Frank Wall Street Reform and Consumer Protection Act as a country that shares an internationally recognised border with the Democratic Republic of the Congo, and includes Angola, Burundi, Central African Republic, Kenya, Republic of Congo, Rwanda, South Sudan, Tanzania, Uganda and Zambia."]
[]
[null,"ASM:  Artisanal and small-scale mining."]
[]
{"$rows_left_out":133}
{"sheet":"Contractor Contact Details","index":5,"n_rows":23,"n_cols":8,"rows_kept":23,"cut":false,"hidden":false,"merged":[[0,1,0,5],[1,2,1,7],[9,2,9,3],[6,2,6,3],[3,2,3,3],[4,2,4,3],[7,2,7,3],[8,2,8,3],[5,2,5,3],[0,6,0,8],[8,4,8,8],[9,4,9,8],[14,2,14,3],[10,2,10,3],[13,2,13,3],[11,2,11,3],[12,2,12,3],[12,4,12,8],[13,4,13,8],[14,4,14,8],[10,4,10,8],[11,4,11,8],[16,3,16,4],[16,5,16,6],[16,7,16,8],[15,3,15,4],[15,5,15,6],[15,7,15,8],[19,5,19,6],[19,7,19,8],[20,3,20,4],[20,5,20,6],[21,5,21,6],[21,7,21,8],[20,7,20,8],[21,3,21,4],[19,3,19,4],[44,1,44,8],[37,1,37,8],[38,1,38,8],[40,1,40,8],[41,1,41,8],[17,3,17,4],[17,5,17,6],[17,7,17,8],[18,3,18,4],[18,5,18,6],[18,7,18,8],[45,1,45,8],[2,4,2,8],[3,4,3,8],[4,4,4,8],[5,4,5,8],[6,4,6,8],[7,4,7,8],[39,1,39,8],[42,1,42,8],[43,1,43,8],[36,1,36,8],[2,2,2,3],[22,1,22,8],[24,1,24,8],[35,1,35,8],[23,1,23,8]]}
[null,"Part 1 Outsourcing Contractor contact details (Please complete relevant sections in the white cells.)"]
[null,"Contractor Name"]
[null,"Head Office ","Address"]
[null,null,"City"]
[null,null,"State/ province "]
[null,null,"Country"]
[null,null,"Telephone number"]
[null,null,"Fax number"]
{"$rows_left_out":16}
{"sheet":"Transferred Materials","index":6,"n_rows":28,"n_cols":20,"rows_kept":28,"cut":false,"hidden":false,"merged":[[25,2,25,3],[25,6,25,7],[25,8,25,10],[26,2,26,3],[26,6,26,7],[26,8,26,10],[23,2,23,3],[23,6,23,7],[23,8,23,10],[24,2,24,3],[24,6,24,7],[24,8,24,10],[21,2,21,3],[21,6,21,7],[21,8,21,10],[22,2,22,3],[22,6,22,7],[22,8,22,10],[19,2,19,3],[19,6,19,7],[19,8,19,10],[20,2,20,3],[20,6,20,7],[20,8,20,10],[17,2,17,3],[17,6,17,7],[17,8,17,10],[18,2,18,3],[18,6,18,7],[18,8,18,10],[15,8,16,10],[1,1,1,9],[5,1,5,5],[6,1,6,5],[7,1,7,5],[8,1,8,5],[9,1,9,5],[10,1,10,5],[15,1,16,1],[15,2,16,3],[15,4,15,5],[15,6,16,7]]}
[null,"Part 2 Information about the Material(s) involved in Custody Transfers "]
[null,"Please list the details associated with the CoC Material(s) involved in CoC transfers handled by the Outsourcing Contractor."]
[]
[null,"2.1 Assessment Context: Please complete relevant sections in the white cells. Information used in this section is used to tailor the assessment toolkit.",null,null,null,null,null,null,null,null,null,null,null,null,null,"REF",null,"Miners","Refiners","R,TorM"]
[null,null,null,null,null,null,null,null,null,null,null,null,null,null,null,true,null,null,false]
[null,"Material",null,null,null,null,"Gold","Platinum","Palladium","Rhodium",null,null,null,null,null,true]
[null,"Type of CoC Material handled by the Outsourcing Contractor. (See Glossary for definitions)",null,null,null,null,null,null,null,null,null,null,null,null,null,{"$error":"#REF!"},null,{"$error":"#REF!"},{"$error":"#REF!"},{"$error":"#REF!"}]
[null,null,null,null,null,null,null,null,null,null,null,null,null,null,null,true,null,false,false,false]
{"$rows_left_out":21}
{"sheet":"Assessment Questions","index":7,"n_rows":22,"n_cols":18,"rows_kept":22,"cut":false,"hidden":false,"merged":[[8,6,9,6],[8,7,9,7],[10,4,13,4],[10,5,13,5],[20,4,21,4],[20,5,21,5],[18,6,19,6],[18,7,19,7],[20,6,21,6],[20,7,21,7],[14,10,17,10],[18,10,21,10],[14,3,17,3],[14,14,17,14],[16,13,17,13],[18,3,21,3],[18,14,21,14],[20,13,21,13],[14,6,17,6],[14,7,17,7],[14,4,17,4],[14,5,17,5],[18,4,19,4],[18,5,19,5],[6,3,9,3],[6,14,9,14],[8,13,9,13],[10,3,13,3],[10,14,13,14],[12,13,13,13],[10,6,13,6],[10,7,13,7],[6,10,9,10],[10,10,13,10],[6,4,7,4],[6,5,7,5],[8,4,9,4],[8,5,9,5],[6,6,7,6],[6,7,7,7],[2,1,2,3],[2,4,2,11],[4,3,5,3],[4,1,5,1],[4,2,5,2],[4,13,5,13],[4,14,5,14],[4,4,5,4],[4,8,4,9],[4,11,4,12],[4,10,5,10],[4,6,4,7],[4,5,5,5]]}
[null,"Part 2 Assessment Questions for Provision 2.2 - to be completed by the Outsourcing Contractor"]
[null,"(Please complete relevant sections in the white cells and use the drop menu in the blue shaded cells.)"]
[null,"Name (Facility or other reference):",null,null,null,null,null,null,null,null,null,null,"Date:"]
[null,null,{"$f":"Calculation!AH18","v":0},"Provisions rated from a total of:",{"$f":"Calculation!$AF$18","v":4},"relevant to the CoC Certification Scope.",null,null,null,null,null,null,null,null,null,null,null,"Yes"]
[null,"Chain of Custody Standard","#","Provision","#","Assessment Questions","Types of evidence",null,"Objective evidence in support of findings",null,"Observations and findings","Responsibility",null,"Performance rating (Please select from drop menu)","Comments / Notes",null,null,"Yes"]
[null,null,null,null,null,null,"Self Assessment or Certification Audit","Surveillance or Re-Certification Audit","Type","Details:",null,"Location","Details:",null,null,null,null,"Yes"]
[null,{"$f":"Calculation!$AE$8","v":"2    Internal Material Controls"},2.1,"Each point where there is an opportunity for Eligible and/or CoC Material in the Custody of an Entity to become mixed with non-Eligible and/or non-CoC Material shall be identified and controls put in place to ensure segregation.","i","Determine that the Entity has identified all points where there is an opportunity for Eligible and/or CoC Material in the Custody of an Entity to become mixed with non-Eligible and/or non-CoC Material.","All points of possible mixing have been identified.\n\nExamples of evidence:\n• Procedure for identification and documentation of all points\n• Interviews with management/ responsible persons\n• Observation of possible mixing points.","All points of possible mixing have been identified.\n\nExample of evidence:\n• Procedure for identification and documentation of all points\n• Evidence that the procedure has been applied during operation \n• Interviews with management/ responsible persons\n• Observation of possible mixing points. "," Documentation",null,null," Head office",null,null,null,null,null,{"$f":"Calculation!U7","v":"Yes"}]
[null,{"$f":"Calculation!$AE$8","v":"2    Internal Material Controls"},null,null,null,null,null,null," Observation",null,null," Divisional/ Business unit",null,{"$f":"IF(N7=\"Not Applicable\", \"Please state the reason for the Not Applicable in the 'Comments/Notes' column.\",\"\")","v":""},null,null,null,{"$f":"Calculation!U8","v":"Yes"}]
{"$rows_left_out":15}
{"sheet":"Summary of Findings","index":8,"n_rows":14,"n_cols":9,"rows_kept":14,"cut":false,"hidden":false,"merged":[]}
[null,"Part 3b Summary of Assessment Findings"]
[]
[null,null,{"$f":"Calculation!AF6","v":"# Relevant Provisions"},{"$f":"Calculation!AH6","v":"# Completed Provisions"},{"$f":"Calculation!AI6","v":"% Completed  Provisions"},{"$f":"Calculation!AJ6","v":"# Conformances"},{"$f":"Calculation!AK6","v":"# Minor Non-Conformances"},{"$f":"Calculation!AL6","v":"# Major Non-Conformances"},{"$f":"Calculation!AM6","v":"# Not Applicable"}]
[null,{"$f":"Calculation!AE7","v":"1    Management System and Responsibilities"},{"$f":"Calculation!AF7","v":0},{"$f":"Calculation!AH7","v":"NA"},{"$f":"Calculation!AI7","v":"NA"},{"$f":"Calculation!AJ7","v":"NA"},{"$f":"Calculation!AK7","v":"NA"},{"$f":"Calculation!AL7","v":"NA"},{"$f":"Calculation!AM7","v":"NA"}]
[null,{"$f":"Calculation!AE8","v":"2    Internal Material Controls"},{"$f":"Calculation!AF8","v":4},{"$f":"Calculation!AH8","v":0},{"$f":"Calculation!AI8","v":0},{"$f":"Calculation!AJ8","v":"NA"},{"$f":"Calculation!AK8","v":"NA"},{"$f":"Calculation!AL8","v":"NA"},{"$f":"Calculation!AM8","v":"NA"}]
[null,{"$f":"Calculation!AE9","v":"3    Outsourcing Contractors and Service Companies"},{"$f":"Calculation!AF9","v":0},{"$f":"Calculation!AH9","v":"NA"},{"$f":"Calculation!AI9","v":"NA"},{"$f":"Calculation!AJ9","v":"NA"},{"$f":"Calculation!AK9","v":"NA"},{"$f":"Calculation!AL9","v":"NA"},{"$f":"Calculation!AM9","v":"NA"}]
[null,{"$f":"Calculation!AE10","v":"4    Eligible Mined Materials"},{"$f":"Calculation!AF10","v":0},{"$f":"Calculation!AH10","v":"NA"},{"$f":"Calculation!AI10","v":"NA"},{"$f":"Calculation!AJ10","v":"NA"},{"$f":"Calculation!AK10","v":"NA"},{"$f":"Calculation!AL10","v":"NA"},{"$f":"Calculation!AM10","v":"NA"}]
[null,{"$f":"Calculation!AE11","v":"5    Eligible Recycled Materials"},{"$f":"Calculation!AF11","v":0},{"$f":"Calculation!AH11","v":"NA"},{"$f":"Calculation!AI11","v":"NA"},{"$f":"Calculation!AJ11","v":"NA"},{"$f":"Calculation!AK11","v":"NA"},{"$f":"Calculation!AL11","v":"NA"},{"$f":"Calculation!AM11","v":"NA"}]
{"$rows_left_out":7}
{"sheet":"Additional Findings","index":9,"n_rows":52,"n_cols":2,"rows_kept":52,"cut":false,"hidden":false,"merged":[[52,1,73,5],[3,1,3,5],[27,1,27,5],[51,1,51,5],[4,1,26,5],[28,1,50,5]]}
[null,"Section 3 - Additional Findings and Suggested Business Improvements"]
[null,"Please provide the following details as appropriate (in the white cells)."]
[]
[null,"Please note any additional general findings made during the Assessment"]
[]
[]
[]
[]
{"$rows_left_out":45}
{"sheet":"Calculation","index":10,"n_rows":45,"n_cols":54,"rows_kept":45,"cut":false,"hidden":true,"merged":[[4,5,4,7],[4,14,4,17],[6,28,9,28],[4,30,4,42],[10,25,13,25],[10,26,13,26],[10,27,13,27],[6,21,9,21],[6,22,9,22],[6,23,9,23],[10,21,13,21],[10,22,13,22],[10,23,13,23],[6,25,9,25],[6,26,9,26],[6,27,9,27],[10,28,13,28],[14,21,17,21],[14,22,17,22],[14,23,17,23],[14,25,17,25],[14,26,17,26],[14,27,17,27],[14,28,17,28],[44,44,47,44],[38,46,38,48],[39,47,39,48],[40,46,40,48],[4,9,4,12],[35,44,37,44],[29,46,29,48],[30,46,30,48],[31,46,31,48],[38,44,40,44],[32,47,32,48],[34,47,34,48],[41,44,43,44],[35,46,35,47],[36,46,36,48],[37,46,37,48],[18,28,21,28],[18,21,21,21],[18,22,21,22],[18,23,21,23],[18,25,21,25],[18,26,21,26],[18,27,21,27]]}
["Calculation Sheet"]
["Do Not Delete"]
[]
[]
[null,{"$f":"'Assessment Questions'!B5:B6","v":"Chain of Custody Standard"},{"$f":"'Assessment Questions'!C5:C6","v":"#"},"#",null,"Scope Ticks (From Contact Details Worksheet)",null,null,null,"Applicability Reference Input White Rows Only, See Notes 1)",null,null,null,null,"Applicability Calculation",null,null,null,null,"Applicability",null,"Applicable Completion Count",null,null,null,"Performance Count",null,null,null,null,"Summary of Stats",null,null,null,null,null,null,null,null,null,null,null,null,null,null,"Eligible Materials",null,null,null,null,null,"Applicability",null,"Notes"]
[null,{"$f":"'Assessment Questions'!B6:B6","v":0},"Provision","Question",null,"Miners","Refiners","Retailers, Traders or Manufacturers",null,"Miners","Refiners General","Refiners Special (Regarding CoC TD)","Retailers, Traders or Manufacturers",null,"Miners","Refiners General","Refiners TOTAL (including CoC TD consideration)","Retailers, Traders or Manufacturers",null,"total","Yes or No","Applicable","Completed","Conditional Completion Reference",null,"Conformance","Minor Non-Conformance","Major Non-Conformance","Not Applicable",null,"CoC Standard","# Relevant Provisions","# Incomplete Provisions","# Completed Provisions","% Completed  Provisions","# Conformances","# Minor Non-Conformances","# Major Non-Conformances","# Not Applicable",null,null,null,null,null,null,null,"Gold","Platinum","Palladium","Rhodium"]
[null,{"$f":"'Assessment Questions'!B7","v":"2    Internal Material Controls"},{"$f":"'Assessment Questions'!C7","v":2.1},{"$f":"IF('Assessment Questions'!E7=\"\",0,1)","v":1},null,{"$f":"#REF!","v":{"$error":"#REF!"}},{"$f":"#REF!","v":{"$error":"#REF!"}},{"$f":"#REF!","v":{"$error":"#REF!"}},"x","R","R","NTD","R",null,{"$f":"IF(J7=\"R\",TRUE,IF(AND(J7=\"IA1\",Calculation!$AZ$15=TRUE),TRUE,IF(AND(J7=\"IA2\", OR(Calculation!$AZ$9=TRUE,Calculation!$AZ$11=TRUE)),TRUE,IF(AND(J7=\"IA3\", OR(Calculation!$AZ$10=TRUE,Calculation!$AZ$11=TRUE)),TRUE))))","v":true},{"$f":"IF(K7=\"R\",TRUE,IF(AND(K7=\"IA1\",Calculation!$AZ$15=TRUE),TRUE,IF(AND(K7=\"IA2\", OR(Calculation!$AZ$9=TRUE,Calculation!$AZ$11=TRUE)),TRUE,IF(AND(K7=\"IA3\", OR(Calculation!$AZ$10=TRUE,Calculation!$AZ$11=TRUE)),TRUE))))","v":true},{"$f":"IF(OR($AZ$18=TRUE,L7=\"R\"),P7,IF(AND($AZ$18=TRUE,L7=\"R\"),TRUE,FALSE))","v":{"$error":"#REF!"}},{"$f":"IF(M7=\"R\",TRUE,IF(AND(M7=\"IA1\",Calculation!$AZ$15=TRUE),TRUE,IF(AND(M7=\"IA2\", OR(Calculation!$AZ$9=TRUE,Calculation!$AZ$11=TRUE)),TRUE,IF(AND(M7=\"IA3\", OR(Calculation!$AZ$10=TRUE,Calculation!$AZ$11=TRUE)),TRUE))))","v":true},null,1,{"$f":"IF(T7<1,\"No\",\"Yes\")","v":"Yes"},{"$f":"IF(U7=\"Yes\",1,0)","v":1},{"$f":"IF('Assessment Questions'!N7=\"\",1,0)","v":1},{"$f":"V7*W7","v":1},null,{"$f":"IF('Assessment Questions'!$N7=Z$6,1,0)","v":0},{"$f":"IF('Assessment Questions'!$N7=AA$6,1,0)","v":0},{"$f":"IF('Assessment Questions'!$N7=AB$6,1,0)","v":0},{"$f":"IF('Assessment Questions'!$N7=AC$6,1,0)","v":0},null,"1    Management System and Responsibilities",{"$f":"SUMIF($B$7:$B$22,$AE7,$V$7:$V$22)","v":0},{"$f":"IF(AF7=0,\"NA\",SUMIF($B$7:$B$22,$AE7,$X$7:$X$22))","v":"NA"},{"$f":"IF(AF7=0,\"NA\", AF7-AG7)","v":"NA"},{"$f":"IF(AF7=0,\"NA\",AH7/AF7)","v":"NA"},{"$f":"IF($AF7=0,\"NA\",IF($AI7=0,\"NA\",SUMIF($B$7:$B$22,$AE7,Z7:Z22)))","v":"NA"},{"$f":"IF($AF7=0,\"NA\",IF($AI7=0,\"NA\",SUMIF($B$7:$B$22,$AE7,AA7:AA22)))","v":"NA"},{"$f":"IF($AF7=0,\"NA\",IF($AI7=0,\"NA\",SUMIF($B$7:$B$22,$AE7,AB7:AB22)))","v":"NA"},{"$f":"IF($AF7=0,\"NA\",IF($AI7=0,\"NA\",SUMIF($B$7:$B$22,$AE7,AC7:AC22)))","v":"NA"},null,null,null,null,null,null,"Mined",false,false,false,false,null,{"$f":"IF(OR(AU7=TRUE,AV7=TRUE,AW7=TRUE,AX7=TRUE),TRUE)","v":false}]
[null,{"$f":"'Assessment Questions'!B8","v":"2    Internal Material Controls"},{"$f":"'Assessment Questions'!C8","v":0},{"$f":"IF('Assessment Questions'!E8=\"\",0,1)","v":0},null,{"$f":"F7","v":{"$error":"#REF!"}},{"$f":"G7","v":{"$error":"#REF!"}},{"$f":"H7","v":{"$error":"#REF!"}},null,{"$f":"J7","v":"R"},"R",{"$f":"L7","v":"NTD"},"R",null,{"$f":"IF(J8=\"R\",TRUE,IF(AND(J8=\"IA1\",Calculation!$AZ$15=TRUE),TRUE,IF(AND(J8=\"IA2\", OR(Calculation!$AZ$9=TRUE,Calculation!$AZ$11=TRUE)),TRUE,IF(AND(J8=\"IA3\", OR(Calculation!$AZ$10=TRUE,Calculation!$AZ$11=TRUE)),TRUE))))","v":true},{"$f":"IF(K8=\"R\",TRUE,IF(AND(K8=\"IA1\",Calculation!$AZ$15=TRUE),TRUE,IF(AND(K8=\"IA2\", OR(Calculation!$AZ$9=TRUE,Calculation!$AZ$11=TRUE)),TRUE,IF(AND(K8=\"IA3\", OR(Calculation!$AZ$10=TRUE,Calculation!$AZ$11=TRUE)),TRUE))))","v":true},{"$error":"#REF!"},{"$f":"IF(M8=\"R\",TRUE,IF(AND(M8=\"IA1\",Calculation!$AZ$15=TRUE),TRUE,IF(AND(M8=\"IA2\", OR(Calculation!$AZ$9=TRUE,Calculation!$AZ$11=TRUE)),TRUE,IF(AND(M8=\"IA3\", OR(Calculation!$AZ$10=TRUE,Calculation!$AZ$11=TRUE)),TRUE))))","v":true},null,1,"Yes",null,null,0,null,null,null,null,null,null,"2    Internal Material Controls",4,4,0,0,{"$f":"IF($AF8=0,\"NA\",IF($AI8=0,\"NA\",SUMIF($B$7:$B$22,$AE8,Z7:Z23)))","v":"NA"},{"$f":"IF($AF8=0,\"NA\",IF($AI8=0,\"NA\",SUMIF($B$7:$B$22,$AE8,AA7:AA23)))","v":"NA"},{"$f":"IF($AF8=0,\"NA\",IF($AI8=0,\"NA\",SUMIF($B$7:$B$22,$AE8,AB7:AB23)))","v":"NA"},{"$f":"IF($AF8=0,\"NA\",IF($AI8=0,\"NA\",SUMIF($B$7:$B$22,$AE8,AC7:AC23)))","v":"NA"},null,null,null,null,null,null,"Mining By-product",false,false,false,false,null,false]
{"$rows_left_out":38}
{"sheet":"Applicability Reference","index":11,"n_rows":24,"n_cols":7,"rows_kept":24,"cut":false,"hidden":true,"merged":[[3,4,3,6],[3,2,5,2],[9,2,11,2],[9,4,9,5],[10,4,10,6],[11,4,11,6],[12,2,15,2],[12,4,12,6],[13,5,13,6],[14,4,14,6],[4,4,4,6],[5,4,5,6],[6,2,8,2],[6,5,6,6],[8,5,8,6]]}
[]
[]
[null,null,null,"CoC Standard Provisions ","Miners ","Refiners","Retailers, Traders or Manufacturers"]
[null,null,"Chain-of-Custody Management","1. Management Systems","Required"]
[null,null,null,"2. Internal Material Controls ","Required"]
[null,null,null,"3. Outsourcing Contractors ","If applicable (IA1)"]
[null,null,"Systems to Confirm Eligibility of Material ","4. Eligible Mined Materials","Required","Not applicable"]
[null,null,null,"5. Eligible Recycled Materials ","Not applicable","Required","If applicable (IA2)"]
{"$rows_left_out":17}
{"sheet":"Reference","index":12,"n_rows":12,"n_cols":7,"rows_kept":12,"cut":false,"hidden":true,"merged":[]}
["Reference Sheet"]
["Do Not Delete"]
[]
[null,"Evidence_Type_2","Evidence_Type_1","Responsibility","Performance","Yes/No","SalesRange"]
[null," Documentation"," Documentation"," Head office","Conformance","Yes","Less than US$1 million"]
[null," Observation"," Observation"," Divisional/ Business unit","Minor Non-Conformance","No","US$1 million - US$5million"]
[null," Testimonial"," Testimonial"," Facility","Major Non-Conformance",null,"US$5 million - US$10million"]
[null,"Documentation and Observation","None"," None","Not Applicable",null,"US$10 million - US$50million"]
{"$rows_left_out":5}
{"sheet":"Revision Status","index":13,"n_rows":12,"n_cols":3,"rows_kept":12,"cut":false,"hidden":true,"merged":[[5,0,5,2]]}
[]
[]
["Revision Status Sheet"]
["Do Not Delete"]
[]
["Chain Of Custody Outsource Contractor Assessment Form (T008_2012)"]
["Revision Status"]
[]
{"$rows_left_out":4}