{"text_format":"1","workbook":"xlsx","n_sheets":13,"sheets":["Cover Page","Main Menu","Preface","Features and Macros","Risk and Toolkit Instructions","1 Define the Risk Context","2 Conduct the Risk Assessment","3 Action Plan","Risk Ratings","Risk Identification Tips ","Risk Reduction Action Message","Revision Status","Reference"],"not_rendered":{"charts":0,"images":13,"macros":1,"external_links":0,"defined_names":27,"comments":1,"pivot_tables":0},"unopened":[],"bounds":{"document_bytes":16777216,"sheet_cells":100000,"rows_first":2000,"rows_last":500,"rows_between":2000,"halvings":0,"cell_chars":16384,"cell_head_chars":4096},"cells_cut":0,"cells_raw":0,"read":"whole","date_system":"1900"}

{"sheet":"Cover Page","index":0,"n_rows":0,"n_cols":0,"rows_kept":0,"cut":false,"hidden":false,"merged":[]}

{"sheet":"Main Menu","index":1,"n_rows":23,"n_cols":3,"rows_kept":23,"cut":false,"hidden":false,"merged":[]}
[]
[null,"RJC Risk Assessment Toolkit"]
[null,"Code of Practice Risk Assessment Toolkit (T010_2013) Revision 0"]
[]
[null,"Main Menu"]
[]
[null,"Background Information","Preface"]
[null,null,"Toolkit Features and Macros"]
{"$rows_left_out":16}
{"sheet":"Preface","index":2,"n_rows":19,"n_cols":2,"rows_kept":19,"cut":false,"hidden":false,"merged":[[13,1,14,1],[15,1,16,1]]}
[null,"Preface - about the Toolkit"]
[null,"RJC Code of Practices (2013) "]
[null,"RJC Risk Assessment Toolkit [Document reference - T010_2013]"]
[null,"A. Background"]
[null,"The Responsible Jewellery Council (RJC) is a not-for-profit standards setting and certification organisation founded in 2005."]
[null,"Our vision is a responsible world-wide supply chain that promotes trust in the global fine jewellery and watch industry."]
[null,"All Commercial Members of the RJC are required to be audited by accredited, third party auditors to verify their conformance with the Code of Practices, and thus achieve RJC Member Certification within two years of joining.  For more information, please visit:"]
[null,"www.responsiblejewellery.com "]
{"$rows_left_out":12}
{"sheet":"Features and Macros","index":3,"n_rows":37,"n_cols":3,"rows_kept":37,"cut":false,"hidden":false,"merged":[[91,1,91,2],[92,1,92,2],[93,1,93,2],[43,1,43,2],[44,1,44,2],[45,1,45,2],[78,1,78,2],[67,1,67,2],[68,1,68,2],[69,1,69,2],[46,1,46,2],[47,1,47,2],[48,1,48,2],[49,1,49,2],[50,1,50,2],[51,1,51,2],[38,1,38,2],[39,1,39,2],[40,1,40,2],[41,1,41,2],[42,1,42,2],[6,1,6,2],[1,1,1,2],[2,1,2,2],[3,1,3,2],[4,1,4,2],[5,1,5,2],[14,1,15,2],[37,1,37,2],[16,1,17,2],[18,1,18,2],[19,1,19,2],[35,1,35,2],[36,1,36,2],[23,1,24,2],[20,1,20,2],[12,1,12,2],[7,1,7,2],[8,1,8,2],[9,1,9,2],[11,1,11,2],[10,1,10,2],[52,1,52,2],[53,1,53,2],[66,1,66,2],[55,1,55,2],[56,1,56,2],[57,1,57,2],[58,1,58,2],[59,1,59,2],[60,1,60,2],[61,1,61,2],[62,1,62,2],[63,1,63,2],[64,1,64,2],[65,1,65,2],[54,1,54,2],[88,1,88,2],[89,1,89,2],[70,1,70,2],[71,1,71,2],[72,1,72,2],[73,1,73,2],[74,1,74,2],[99,1,99,2],[100,1,100,2],[101,1,101,2],[75,1,75,2],[76,1,76,2],[77,1,77,2],[90,1,90,2],[79,1,79,2],[80,1,80,2],[81,1,81,2],[82,1,82,2],[83,1,83,2],[84,1,84,2],[85,1,85,2],[86,1,86,2],[87,1,87,2],[94,1,94,2],[95,1,95,2],[96,1,96,2],[97,1,97,2],[98,1,98,2],[103,1,103,2],[104,1,104,2],[110,1,110,2],[111,1,111,2],[102,1,102,2],[105,1,105,2],[106,1,106,2],[107,1,107,2],[108,1,108,2],[109,1,109,2]]}
[null,"Toolkit Features and Macros"]
[null,"This worksheet contains information about the toolkit and its features  The following topics are covered (navigate by clicking the topic headings):"]
[null,"Features and Layout"]
[null,"Enabling Macros"]
[]
[]
[null,"Features and Layout"]
[]
{"$rows_left_out":30}
{"sheet":"Risk and Toolkit Instructions","index":4,"n_rows":97,"n_cols":2,"rows_kept":97,"cut":false,"hidden":false,"merged":[[21,1,21,2],[30,1,30,2],[38,1,38,2],[39,1,39,2],[49,1,49,2],[43,1,43,2],[29,1,29,2],[33,1,33,2],[40,1,40,2],[41,1,41,2],[42,1,42,2],[26,1,26,2],[34,1,34,2],[35,1,35,2],[36,1,36,2],[37,1,37,2],[1,1,1,2],[2,1,2,2],[14,1,14,2],[17,1,20,2],[57,1,57,2],[45,1,45,2],[47,1,47,2],[52,1,52,2],[54,1,54,2],[55,1,55,2],[56,1,56,2],[12,1,12,2],[13,1,13,2],[15,1,16,2],[22,1,25,2],[53,1,53,2],[51,1,51,2],[77,1,77,2],[69,1,69,2],[80,1,80,2],[68,1,68,2],[58,1,58,2],[73,1,73,2],[70,1,70,2],[60,1,60,2],[62,1,62,2],[27,1,27,2],[28,1,28,2],[31,1,31,2],[32,1,32,2],[96,1,96,2],[44,1,44,2],[46,1,46,2],[86,1,86,2],[90,1,90,2],[59,1,59,2],[61,1,61,2],[65,1,65,2],[66,1,66,2],[71,1,71,2],[72,1,72,2],[64,1,64,2],[83,1,83,2],[63,1,63,2],[94,1,94,2],[95,1,95,2],[75,1,75,2],[76,1,76,2],[93,1,93,2],[78,1,78,2],[79,1,79,2],[84,1,84,2],[85,1,85,2],[82,1,82,2],[87,1,87,2],[88,1,88,2],[92,1,92,2],[91,1,91,2]]}
[null,"Risk and Toolkit Instructions"]
[null,"This worksheet contains guidance on conducting Risk Assessments with the tookit. The following topics are covered (navigate by clicking the topic headings):"]
[null,"Content"]
[null,"Introduction to Risk Assessments"]
[null,"How to Assess Risks in your Business"]
[null,"Step 1: Define the Risk Context"]
[null,"Step 2: Conduct the Risk Assessment"]
[null,"2.1: Risk identification and Description"]
{"$rows_left_out":90}
{"sheet":"1 Define the Risk Context","index":5,"n_rows":8,"n_cols":3,"rows_kept":8,"cut":false,"hidden":false,"merged":[[11,3,11,4],[12,3,12,4],[7,3,7,4],[2,3,2,4],[3,3,3,4],[4,3,4,4],[5,3,5,4],[6,3,6,4],[23,3,23,4],[24,3,24,4],[7,2,24,2],[18,3,18,4],[19,3,19,4],[20,3,20,4],[21,3,21,4],[22,3,22,4],[13,3,13,4],[14,3,14,4],[15,3,15,4],[16,3,16,4],[17,3,17,4],[8,3,8,4],[9,3,9,4],[10,3,10,4]]}
[null,null,"Step 1: Define the Risk Context"]
[null,null,"Provide the background context including the objectives, area, assumptions and limitations associated with the risk assessment."]
[null,null,"Company name:"]
[null,null,"Date of assessment:"]
[null,null,"Objective:  Why is the risk assessment being conducted (e.g. to support the RJC Self Assessment, annual review, changing laws, new business partner, or newly acquired business)."]
[null,null,"Scope - Location/Practice: \nWhat area / location / jurisdiction/practice does the risk assessment cover?"]
[null,null,"Assumptions and Limitations:  List any assumptions and/or limitations that apply to this risk assessment."]
[null,null,"People involved: List all people involved in the risk assessment including internal and external resources."]
{"$rows_left_out":1}
{"sheet":"2 Conduct the Risk Assessment","index":6,"n_rows":13,"n_cols":27,"rows_kept":13,"cut":false,"hidden":false,"merged":[[2,2,2,6],[3,2,3,6],[1,8,1,9],[2,8,2,9],[3,8,3,9]]}
["x",null,null,null,null,null,null,null,null,null,null,null,null,null,{"$f":"IF(N1=\"\",\"\",IF(N1=\"Yes\",IF(ISERROR(INDEX(Reference!$E$16:$G$19,(VLOOKUP(M1,Reference!$F$26:$G$29,2,0)),(VLOOKUP(L1,Reference!$D$26:$E$28,2,0)))),\"\",INDEX(Reference!$E$16:$G$19,(VLOOKUP(M1,Reference!$F$26:$G$29,2,0)),(VLOOKUP(L1,Reference!$D$26:$E$28,2,0)))),IF(N1=\"No\", IF(ISERROR(INDEX(Reference!$E$20:$G$23,(VLOOKUP(M1,Reference!$F$26:$G$29,2,0)),(VLOOKUP(L1,Reference!$D$26:$E$28,2,0)))),\"\",INDEX(Reference!$E$20:$G$23,(VLOOKUP(M1,Reference!$F$26:$G$29,2,0)),(VLOOKUP(L1,Reference!$D$26:$E$28,2,0)))))))","v":""},null,null,null,{"$f":"T1+(IF(OR(L1=\"\",M1=\"\"),0,IF(L1=Reference!$D$5, VLOOKUP(M1,Reference!$F$26:$G$29,2,0),IF(L1=Reference!$D$6,(VLOOKUP(M1,Reference!$F$26:$G$29,2,0)+0.1),IF(L1=Reference!$D$7,(VLOOKUP(M1,Reference!$F$26:$G$29,2,0)+0.2), 0)))))","v":0},{"$f":"IF(N1=\"No\",0.1,0)","v":0},null,null,null,null,null,null,{"$f":"IF(U1=\"\",0,IF(V1=\"No\", (VLOOKUP(U1,Reference!$F$26:$G$29,2,0))+0.1,VLOOKUP(U1,Reference!$F$26:$G$29,2,0)))","v":0}]
["x",null,"Step 2: Conduct the Risk Assessment",null,null,null,null,null,"Press to add a new Risk row"]
["x",null,{"$f":"IF('1 Define the Risk Context'!D4=\"\",\"\",'1 Define the Risk Context'!D4)","v":""},null,null,null,null,null,"Specify Row to delete (Note: Row 10 or higher)"]
["x",null,{"$f":"IF('1 Define the Risk Context'!D6=\"\",\"\",'1 Define the Risk Context'!D6)","v":""},null,null,null,null,null,"Sort Risks By Ratings"]
["x"]
["x"]
["x",null,"2.1 Risk Identification and Description",null,null,null,"(Link to Risk Identification Tips and Guidance worksheet)",null,null,null,"2.2 Risk Controls",null,"2.3 Risk Rating",null,"(Link to Risk Rating worksheet)","2.4 Communication & Review",null,null,"x",null,null,null,null,null,null,null,"x"]
["x",null,"Risk Type ","Risk ID","Date","Location","Activity / Subject","Risk Event","Risk Causes (actual or potential)","Rick Impact(s)","Existing Controls","Effectiveness of Controls","Risk Rating","Acceptability?","Reccommended Next Steps","Stakeholders","Next Review","Comments / Notes"]
{"$rows_left_out":6}
{"sheet":"3 Action Plan","index":7,"n_rows":16,"n_cols":14,"rows_kept":16,"cut":false,"hidden":false,"merged":[[2,2,2,6],[3,2,3,6],[8,2,8,6]]}
["x"]
["x",null,"Step 3: Risk Reduction Action Plan",null,null,null,null,"Prepare Action Plan (based on Recommended Next Steps)"]
["x",null,{"$f":"IF('1 Define the Risk Context'!D3=\"\",\"\",'1 Define the Risk Context'!D3)","v":""},null,null,null,null,"Specify Row to delete (Note: Row 10 or higher)"]
["x",null,{"$f":"IF('1 Define the Risk Context'!D6=\"\",\"\",'1 Define the Risk Context'!D6)","v":""}]
["x"]
["x"]
["x",null,"2.1 Risk Identification and Description",null,null,null,null,"3. Risk Reduction Action Plan"]
["x",null,"Risk Type","Risk ID","Location","Activity/ Subject","Risk Event","Risk Reduction Action (What)","Responsibility (Who)","Due Date (When)","Status","Date Reviewed","Completion Sign off (Name)","Comments"]
{"$rows_left_out":9}
{"sheet":"Risk Ratings","index":8,"n_rows":14,"n_cols":6,"rows_kept":14,"cut":false,"hidden":false,"merged":[[0,1,0,2],[3,1,4,1],[3,2,3,5],[1,1,1,5],[2,1,2,5]]}
[null,"Risk Ratings - Reference Table"]
[null,"The table below provides a description for each of the Risk Levels: Low, Moderate, High and Extreme.  Descriptions are offered for 'General' risks, as well as for specific \nRisk Types (e.g. Business Products,  Community and Reputation, Environment, Health & Safety, etc.). They can be used as a reference to help you determine the \n'reasonable worst case scenario' in column M of the '2. Conduct the Risk Assessment' worksheet."]
[]
[null,"Risk Type","Risk Level Descriptions"]
[null,null,"Low Risk","Moderate Risk","High Risk","Extreme Risk"]
[null,"General","Systems,  processes and controls developed and implemented, and these are regularly checked for effectiveness.","Systems, processes and controls developed and implemented, but these are new or have not been subject to a review to assure their effectiveness.","The development of systems, processes and controls is underway but not yet complete.","Lack or an absence of effective systems, processes or controls."]
[null,"Business Products","Systems have been developed and implemented to ensure accurate disclosure of product information.\n\nEffective controls in place for product grading and appraisal services.\n\nSystems which are independently verified as being effective, have been developed and implemented to comply with KPCS and WDC System of Warranties.\n\n","Not all employees are aware of accurate product information. \n\nGrading and appraisal controls although in place, are new and untested.\n\nSystems to comply with the KPCS and WDC SoW are in place but these have not been independently verified as being effective.  All shipments of rough diamonds are accompanying by a KP Certificate, however, evidence that some invoices have been received or issued without the WDC System of Warranties Statement.","Limited or ineffective control of product information and/or personnel have not received appropriate training about the products.\n\nLimited controls in place for product grading and appraisal services.\n\nLimited documented systems to comply with the KPCS and WDC SoW. Not all KP Certificates are obtained for shipments of rough diamonds and not all invoices have been received or issued without the WDC System of Warranties Statement.","Evidence if incorrect product information (in printed or verbal media).\n\nPoor or no controls in place for product grading and appraisal services.\n \nPoor or no systems in place to comply with the KPCS and WDC SoW. Personnel are not fully unaware of requirements under KPCS or WDC SoW.  Majority of required KP Certificates and/or invoices with the WDC SoW Statement are absent or not available."]
[null,"Community and Reputation","Minimal adverse feedback or concerns from community and neighbouring stakeholders regarding project or operational activities.  \n\nNo adverse media or NGO coverage. \n\nLow level but repairable damage to common place structures.\n","Isolated local complaints about project or operational activities.\n\nSome adverse coverage in the local media.\n\nSome criticism from local NGO’s.\n\nMinor medium term social impact on local amenity and population but repairable.\n","Repeated complaints about the Member, its projects or operational activities.\n\nAdverse coverage in the national media and localised community protests.\n\nAdverse attention from NGO’s.\n\nMajor long term damage to items of cultural significant.\n","Widespread complaints about the Member, its projects or operational activities.\n\nAdverse coverage in the international media and widespread community outrage.\n\nWidespread adverse attention from multiple NGO’s.\n\nPermanent damage to items of cultural significance.\n"]
{"$rows_left_out":7}
{"sheet":"Risk Identification Tips ","index":9,"n_rows":14,"n_cols":5,"rows_kept":14,"cut":false,"hidden":false,"merged":[[3,1,4,1],[3,2,3,3],[3,4,4,4],[0,1,0,4],[2,1,2,4],[1,1,1,4]]}
[null,"Risk Identification Tips and Guidance"]
[null,"For a Risk Assessment to be effective, it should be conducted by a team of two or more to ensure an objective outcome is achieved. Ideally a team should consist of appropriate operational, technical, management and support personnel. Wherever relevant, external interested parties may be involved in the process. "]
[null,"The table below provides additional prompts and questions to help identify risk scenarios.  These are categorised by Risk Type.  The table also highlights which COP Provisions require a risk assessment as part of their implementation.  Other COP Provisions where their implementation may benefit from a risk assessment are also shown. "]
[null,"Risk Type","RJC Code of Practice Reference",null,"Risk Identification Guidance Checklist (tips for guidance purposes only)"]
[null,null,"Provisions with Mandatory Risk Assessment","Other Provisions were an Risk Assessment may be conducted"]
[null,"General",null,null,"Comprehensive planning and preparation will also greatly benefit the outcomes of the risk assessment.  For instance, the following activities should be carried out and information gathered prior to commencing the formal risk assessment:\n• Identify potential issues and hazards by:\n   o Walking around the workplace\n   o Asking employees what they think\n   o Checking with suppliers and contractors\n• Review the major activities, and processes that are carried out.\n• Review impacts from plant and equipment, materials and products\n• Consider various operating modes including:\n   o normal business as usual activities\n   o new or changed activities\n   o maintenance activities\n   o abnormal events such as one off projects or infrequent dealings / transactions\n   o an emergency event.\n• Review historical performance\n• Review previous related incidents (internal or external) and the lessons learned from these."]
[null,"Business Products",null,"26. Product Disclosure\n27. KPCS and WDC System of Warranties\n28. Grading and Appraisal","• Effectiveness of controls to manage:\n   o Product Health & Safety Information \n   o Provenance Claims\n   o Product Disclosure\n   o Compliance with Kimberley Product Certification Scheme  \n   o Compliance with World Diamond Council System of Warranties"]
[null,"Community and Reputation","30. Community Engagement\n32. Impact Assessment ","8. Community Development\n30. Community Engagement \n31. Indigenous Peoples and FPIC\n32. Impact Assessment\n33. ASM \n34. Resettlement \n35. Emergency Response\n40. Mine Rehabilitation and Closure ","• Are there nearby communities that may be affected by the operations or proposed developments?\n• What processes are in place to:\n   o identify stakeholder needs\n   o respond to complaints & grievances?\n• Consider risk of:\n   o Poor media coverage\n   o reputation damage due to association with less business partners with unethical business practices\n• What controls are in place to manage social and community-related impacts?\n• Risks and controls for:\n   o resettlement and relocation (Mining sector only)\n   o Indigenous Peoples and Free Prior Informed Consent (Mining sector only)\n   o Artisanal and Small-scale Mining (Mining sector only)"]
{"$rows_left_out":7}
{"sheet":"Risk Reduction Action Message","index":10,"n_rows":16,"n_cols":7,"rows_kept":16,"cut":false,"hidden":true,"merged":[[6,4,6,6],[8,2,11,2],[12,2,15,2]]}
["",null,"Recommended Message for Risk Reduction Action Plan"]
[null,null,"The following table outlines the message generated in the Risk Assessment worksheet based on responses provided for:"]
[null,null,"- Risk Control Effectiveness (Reliable, Intermittent, Unreliable or No Control)"]
[null,null,"- Risk Rating (Low, Moderate, High or Extreme)"]
[null,null,"- Risk Acceptability (Yes or No)"]
[]
[null,null,"Action Plan Message",null,"Control Effectiveness"]
[null,null,"Acceptability","Risk Rating","Reliable","Intermittent","Unreliable or No Control"]
{"$rows_left_out":9}
{"sheet":"Revision Status","index":11,"n_rows":11,"n_cols":3,"rows_kept":11,"cut":false,"hidden":true,"merged":[]}
[]
[]
["Revision Status Sheet"]
[]
[]
["Risk Assessment Toolkit (T008_2013)"]
["Revision Status"]
[]
{"$rows_left_out":4}
{"sheet":"Reference","index":12,"n_rows":40,"n_cols":7,"rows_kept":40,"cut":false,"hidden":true,"merged":[[15,2,18,2],[13,4,13,6],[19,2,22,2],[30,4,30,6]]}
["",null,"Reference Sheet"]
[null,null,"Do Not Delete"]
[null,null,"Only change white cells"]
[null,null,"Type","Control","Risk Rating","Acceptability"]
[null,null,"Business Products","Reliable","Low","Yes"]
[null,null,"Community and Reputation","Intermittent","Moderate","No"]
[null,null,"Environment","Unreliable or No Control","High"]
[null,null,"Health and Safety",null,"Extreme"]
{"$rows_left_out":32}